BDBM50235213 CHEMBL4102852
SMILES Fc1ccc(c(F)c1)-c1cc(=O)c2ccc3ccccc3c2o1
InChI Key InChIKey=DWIUZVWXIDZOHU-UHFFFAOYSA-N
Data  1 IC50
  Tab Delimited (TSV)   2D SDfile   Computed 3D by Vconf -m prep SDfile
Find this compound or compounds like it in BindingDB:
Activity Spreadsheet -- Enzyme Inhibition Constant Data from BindingDB
Found 1 hit for monomerid = 50235213
TargetCarboxylic ester hydrolase(Sus scrofa)
Guru Nanak Dev University
Curated by ChEMBL
LigandPNGBDBM50235213(CHEMBL4102852)
Affinity DataIC50:  1.40nM. Assay description: Inhibition of porcine cholesterol esterase using para-nitrophenyl butyrate as substrate after 5 mins in presence of sodium taurocholate by spectropho...
In DepthDetails ArticlePubMed