BDBM50240522 CHEMBL4067946
SMILES [H][C@]12O[C@](O)([C@H](C)C[C@@H]1OC)C(=O)C(=O)N1CCCC[C@@]1([H])C(=O)O[C@@H]([C@H](C)[C@@H](O)CC(=O)[C@H](CC)\C=C(C)\C[C@H](C)C[C@@H]2OC)C(\C)=C\[C@@H]1CC[C@@H](OC(=O)N2CCN(C)CC2)[C@@H](C1)OC
InChI Key InChIKey=SRPHOEIXOXJNNU-JMMSSZQXSA-N
Data  2 IC50
  Tab Delimited (TSV)   2D SDfile   Computed 3D by Vconf -m prep SDfile
Find this compound or compounds like it in BindingDB:
Activity Spreadsheet -- Enzyme Inhibition Constant Data from BindingDB
Found 2 hits for monomerid = 50240522
TargetPeptidyl-prolyl cis-trans isomerase FKBP1A(Homo sapiens (Human))
Amplyx Pharmaceuticals
Curated by ChEMBL
LigandPNGBDBM50240522(CHEMBL4067946)
Affinity DataIC50:  1.74E+3nM. Assay description: Antagonist activity at recombinant human N-terminal His6-tagged FKBP12 expressed in Escherichia coli assessed as inhibition of FK506 mediated FKBP12 ...
In DepthDetails ArticlePubMed
TargetPeptidyl-prolyl cis-trans isomerase FKBP1A(Homo sapiens (Human))
Amplyx Pharmaceuticals
Curated by ChEMBL
LigandPNGBDBM50240522(CHEMBL4067946)
Affinity DataIC50:  11nM. Assay description: Antagonist activity at human FKBP12 measured after 30 mins by fluorescein labelled SLF tracer based fluorescence polarization assay
In DepthDetails ArticlePubMed