BDBM50240809 CHEMBL4077448
SMILES Cc1n[nH]c2ccc(cc12)-c1cc(N[C@@H](CO)c2ccccc2)cnc1-c1cc(F)cc(F)c1O
InChI Key InChIKey=XRXNDGMCQAAXTI-VWLOTQADSA-N
Data  4 IC50
  Tab Delimited (TSV)   2D SDfile   Computed 3D by Vconf -m prep SDfile
Find this compound or compounds like it in BindingDB:
Activity Spreadsheet -- Enzyme Inhibition Constant Data from BindingDB
Found 4 hits for monomerid = 50240809
TargetFibroblast growth factor receptor 1(Homo sapiens (Human))
University Of Chinese Academy Of Sciences
Curated by ChEMBL
LigandPNGBDBM50240809(CHEMBL4077448)
Affinity DataIC50:  64nM. Assay description: Inhibition of recombinant human FGFR1 using poly (Glu,Tyr) 4:1 as substrate after 60 mins by ELISA
In DepthDetails ArticlePubMed
TargetFibroblast growth factor receptor 2(Homo sapiens (Human))
University Of Chinese Academy Of Sciences
Curated by ChEMBL
LigandPNGBDBM50240809(CHEMBL4077448)
Affinity DataIC50:  280nM. Assay description: Inhibition of FGFR2 in human SNU16 cells assessed as inhibition of cell proliferation after 72 hrs by cell counting kit-8 assay
In DepthDetails ArticlePubMed
TargetFibroblast growth factor receptor 3(Homo sapiens (Human))
University Of Chinese Academy Of Sciences
Curated by ChEMBL
LigandPNGBDBM50240809(CHEMBL4077448)
Affinity DataIC50:  58nM. Assay description: Inhibition of recombinant human FGFR3 using poly (Glu,Tyr) 4:1 as substrate after 60 mins by ELISA
In DepthDetails ArticlePubMed
TargetFibroblast growth factor receptor 2(Homo sapiens (Human))
University Of Chinese Academy Of Sciences
Curated by ChEMBL
LigandPNGBDBM50240809(CHEMBL4077448)
Affinity DataIC50:  3.40nM. Assay description: In vitro inhibition of HMG-CoA reductase in solubilized rat liver.
In DepthDetails ArticlePubMed