BDBM50245076 CHEMBL4080766
SMILES CCOC(=O)CC[C@@H](NC(=O)[C@H](C)NC(=O)CNC(=O)\C=C\c1ccc(O)c(OC)c1)C(=O)OCC
InChI Key InChIKey=HMPWDFBAVVUNDG-QTVNVXQXSA-N
Data  1 EC50
  Tab Delimited (TSV)   2D SDfile   Computed 3D by Vconf -m prep SDfile
Find this compound or compounds like it in BindingDB:
Activity Spreadsheet -- Enzyme Inhibition Constant Data from BindingDB
Found 1 hit for monomerid = 50245076
TargetNucleotide-binding oligomerization domain-containing protein 2(Homo sapiens (Human))
University Of Ljubljana
Curated by ChEMBL
LigandPNGBDBM50245076(CHEMBL4080766)
Affinity DataEC50:  2.79E+3nM. Assay description: Agonist activity at human NOD2 expressed in HEK-Blue cells assessed as induction of NF-kB transcriptional activity after 18 hrs by SEAP reporter gene...
In DepthDetails ArticlePubMed