BDBM50246116 CHEMBL4063253
SMILES CC(C)C[C@H](NC(=O)[C@H](CC(O)=O)NC(=O)[C@H](CC(C)C)NC(=O)[C@]1(C)CCCCCCCCCCCC[C@](C)(NC(=O)CNC(=O)[C@H](CCC(N)=O)NC(=O)COCCOCCNC(=S)Nc2ccc3c(c2)C(=O)OC32c3ccc(O)cc3Oc3cc(O)ccc23)C(=O)N[C@H](C(=O)N[C@@H](CC(O)=O)C(=O)N1)C12CC3CC(CC(C3)C1)C2)C(=O)N[C@@H](C)C(=O)N[C@@H](CO)C(N)=O
InChI Key InChIKey=OKMBMSGADZOQGR-JGRDGRCCSA-N
Data  1 Kd
  Tab Delimited (TSV)   2D SDfile   Computed 3D by Vconf -m prep SDfile
Find this compound or compounds like it in BindingDB:
Activity Spreadsheet -- Enzyme Inhibition Constant Data from BindingDB
Found 1 hit for monomerid = 50246116
Target14-3-3 protein zeta/delta(Homo sapiens)
Chemical Genomics Centre Of The Max Planck Society
Curated by ChEMBL
LigandPNGBDBM50246116(CHEMBL4063253)
Affinity DataKd:  59nM. Assay description: Binding affinity to 14-3-3zeta (1 to 230 residues) (unknown origin) after 1 hr using FITC labeled compound by fluorescence polarization assay
In DepthDetails ArticlePubMed