BDBM50246944 CHEMBL4080606::US10570121, Example 38
SMILES Cc1cc(C)c(CN2CCc3c(Cl)cc(C(CO)C4CCOCC4)c(Cl)c3C2=O)c(=O)[nH]1
InChI Key InChIKey=GJPUEPDRSRFYRD-UHFFFAOYSA-N
Data  8 IC50
  Tab Delimited (TSV)   2D SDfile   Computed 3D by Vconf -m prep SDfile
Find this compound or compounds like it in BindingDB:
Activity Spreadsheet -- Enzyme Inhibition Constant Data from BindingDB
Found 8 hits for monomerid = 50246944
TargetHistone-lysine N-methyltransferase EZH2(Homo sapiens (Human))
Wuxi Apptec
Curated by ChEMBL
LigandPNGBDBM50246944(CHEMBL4080606 | US10570121, Example 38)
Affinity DataIC50:  1.48E+4nM. Assay description: Inhibition of EZH2 in human KARPAS422 cells assessed as reduction in H3K27me3 level after 72 hrs by ELISA
Ligand InfoPC cidPC sid
In DepthDetails ArticlePubMed
TargetHistone-lysine N-methyltransferase EZH2(Homo sapiens (Human))
Wuxi Apptec
Curated by ChEMBL
LigandPNGBDBM50246944(CHEMBL4080606 | US10570121, Example 38)
Affinity DataIC50:  1.48E+4nM. Assay description: Inhibition of EZH2 in human KARPAS422 cells assessed as reduction in H3K27me3 level after 72 hrs by ELISA
Ligand InfoPC cidPC sid
In DepthDetails ArticlePubMed
TargetHistone-lysine N-methyltransferase EZH2(Homo sapiens (Human))
Wuxi Apptec
Curated by ChEMBL
LigandPNGBDBM50246944(CHEMBL4080606 | US10570121, Example 38)
Affinity DataIC50:  4nM. Assay description: A. Compound preparation1. Prepare 10 mM stock solutions in 100% DMSO from solid material2. Serial dilute 10 mM compound stocks either 2 or 3-fold in ...
Ligand InfoPC cidPC sid
In DepthDetails US Patent
TargetHistone-lysine N-methyltransferase EZH2 [2-746,Y641N](Homo sapiens (Human))
Pfizer
US Patent
LigandPNGBDBM50246944(CHEMBL4080606 | US10570121, Example 38)
Affinity DataIC50:  740nM. Assay description: A. Compound preparation1. Prepare 10 mM stock solutions in 100% DMSO from solid material2. Serial dilute 10 mM compound stocks either 2 or 3-fold in ...
Ligand InfoPC cidPC sid
In DepthDetails US Patent
TargetHistone-lysine N-methyltransferase EZH2(Homo sapiens (Human))
Wuxi Apptec
Curated by ChEMBL
LigandPNGBDBM50246944(CHEMBL4080606 | US10570121, Example 38)
Affinity DataIC50:  1nM. Assay description: A. Compound preparation1. Prepare 10 mM stock solutions in 100% DMSO from solid material2. Serial dilute 10 mM compound stocks either 2 or 3-fold in ...
Ligand InfoPC cidPC sid
In DepthDetails US Patent
TargetHistone-lysine N-methyltransferase EZH2 [2-746,Y641N](Homo sapiens (Human))
Pfizer
US Patent
LigandPNGBDBM50246944(CHEMBL4080606 | US10570121, Example 38)
Affinity DataIC50:  2nM. Assay description: A. Compound preparation1. Prepare 10 mM stock solutions in 100% DMSO from solid material2. Serial dilute 10 mM compound stocks either 2 or 3-fold in ...
Ligand InfoPC cidPC sid
In DepthDetails US Patent
TargetHistone-lysine N-methyltransferase EZH2(Homo sapiens (Human))
Wuxi Apptec
Curated by ChEMBL
LigandPNGBDBM50246944(CHEMBL4080606 | US10570121, Example 38)
Affinity DataIC50:  378nM. Assay description: A. Compound preparation1. Prepare 10 mM stock solutions in 100% DMSO from solid material2. Serial dilute 10 mM compound stocks either 2 or 3-fold in ...
Ligand InfoPC cidPC sid
In DepthDetails US Patent
TargetHistone-lysine N-methyltransferase EZH2 [2-746,Y641N](Homo sapiens (Human))
Pfizer
US Patent
LigandPNGBDBM50246944(CHEMBL4080606 | US10570121, Example 38)
Affinity DataIC50:  6nM. Assay description: A. Compound preparation1. Prepare 10 mM stock solutions in 100% DMSO from solid material2. Serial dilute 10 mM compound stocks either 2 or 3-fold in ...
Ligand InfoPC cidPC sid
In DepthDetails US Patent