BDBM50247208 2-oxo-2-phenylethyl 1-(methylsulfonyl)indoline-5-carboxylate::CHEMBL475541::cid_645394
SMILES CS(=O)(=O)N1CCc2cc(ccc12)C(=O)OCC(=O)c1ccccc1
InChI Key InChIKey=ZQZUYCOCZVCTIC-UHFFFAOYSA-N
Data  2 IC50
  Tab Delimited (TSV)   2D SDfile   Computed 3D by Vconf -m prep SDfile
Find this compound or compounds like it in BindingDB:
Activity Spreadsheet -- Enzyme Inhibition Constant Data from BindingDB
Found 2 hits for monomerid = 50247208
TargetCollagenase 3(Homo sapiens (Human))
Florida Atlantic University
Curated by ChEMBL
LigandPNGBDBM50247208(2-oxo-2-phenylethyl 1-(methylsulfonyl)indoline-5-c...)
Affinity DataIC50:  9.90E+3nM. Assay description: Inhibition of human recombinant MMP13 expressed in Escherichia coli
In DepthDetails ArticlePubMed
TargetCollagenase 3(Homo sapiens (Human))
Florida Atlantic University
Curated by ChEMBL
LigandPNGBDBM50247208(2-oxo-2-phenylethyl 1-(methylsulfonyl)indoline-5-c...)
Affinity DataIC50:  9.92E+3nM. Assay description: Source (MLSCN Center Name): The Scripps Research Institute Molecular Screening Center Center Affiliation: The Scripps Research Institute, TSRI Assay ...
In DepthDetails PCBioAssay