BDBM50247209 5-cyclohexyl-5-(2-(pyridin-4-yl)ethyl)pyrimidine-2,4,6(1H,3H,5H)-trione::CHEMBL475742::cid_651441
SMILES O=C1NC(=O)C(CCc2ccncc2)(C2CCCCC2)C(=O)N1
InChI Key InChIKey=RLJYCZREXIWYAI-UHFFFAOYSA-N
Data  2 IC50
  Tab Delimited (TSV)   2D SDfile   Computed 3D by Vconf -m prep SDfile
Find this compound or compounds like it in BindingDB:
Activity Spreadsheet -- Enzyme Inhibition Constant Data from BindingDB
Found 2 hits for monomerid = 50247209
TargetCollagenase 3(Homo sapiens (Human))
Florida Atlantic University
Curated by ChEMBL
LigandPNGBDBM50247209(5-cyclohexyl-5-(2-(pyridin-4-yl)ethyl)pyrimidine-2...)
Affinity DataIC50:  2.50E+3nM. Assay description: Inhibition of human recombinant MMP13 expressed in Escherichia coli
In DepthDetails ArticlePubMed
TargetCollagenase 3(Homo sapiens (Human))
Florida Atlantic University
Curated by ChEMBL
LigandPNGBDBM50247209(5-cyclohexyl-5-(2-(pyridin-4-yl)ethyl)pyrimidine-2...)
Affinity DataIC50:  2.46E+3nM. Assay description: Source (MLSCN Center Name): The Scripps Research Institute Molecular Screening Center Center Affiliation: The Scripps Research Institute, TSRI Assay ...
In DepthDetails PCBioAssay