BDBM50247586 5-Methyl-2-N-Phenylisothiazol-3(2H)-one::CHEMBL489895::cid_44564011
SMILES Cc1cc(=O)n(s1)-c1ccccc1
InChI Key InChIKey=HDZOSEIWORKVCL-UHFFFAOYSA-N
Data  3 IC50
  Tab Delimited (TSV)   2D SDfile   Computed 3D by Vconf -m prep SDfile
Find this compound or compounds like it in BindingDB:
Activity Spreadsheet -- Enzyme Inhibition Constant Data from BindingDB
Found 3 hits for monomerid = 50247586
TargetGlucose-6-phosphate 1-dehydrogenase(Leuconostoc mesenteroides)
University Of Pittsburgh
Curated by PubChem BioAssay
LigandPNGBDBM50247586(5-Methyl-2-N-Phenylisothiazol-3(2H)-one | CHEMBL48...)
Affinity DataIC50: >2.50E+4nM. Assay description: Excerpt from MH082340 application (Dr. James Morris, Clemson University) Trypanosoma brucei, the digenic protozoan parasite that causes African sleep...
In DepthDetails PCBioAssay
TargetHistone acetyltransferase KAT2B(Homo sapiens (Human))
The Institute Of Cancer Research
Curated by ChEMBL
LigandPNGBDBM50247586(5-Methyl-2-N-Phenylisothiazol-3(2H)-one | CHEMBL48...)
Affinity DataIC50: >2.00E+5nM. Assay description: Inhibition of GST-fused recombinant HAT PCAF expressed in Escherichia coli by filter assay
In DepthDetails ArticlePubMed
TargetPhosphotransferase(Trypanosoma brucei)
University Of Pittsburgh
Curated by PubChem BioAssay
LigandPNGBDBM50247586(5-Methyl-2-N-Phenylisothiazol-3(2H)-one | CHEMBL48...)
Affinity DataIC50:  2.50E+4nM. Assay description: Excerpt from MH0882340 application (Dr. James Morris, Clemson University) Trypanosoma brucei, the digenic protozoan parasite that causes African slee...
In DepthDetails PCBioAssay