BDBM50249677 2,10-Dihydroxy-6-[(quinolin-3-ylmethyl)amino]-13-(beta-D-glucopyranosyl)-12,13-dihydro-5H-indolo[2,3-a]pyrrolo[3,4-c]carbazole-5,7(6H)-dione::CHEMBL450991
SMILES OC[C@H]1O[C@@H](On2c3cc(O)ccc3c3c4C(=O)N(NCc5cnc6ccccc6c5)C(=O)c4c4c5ccc(O)cc5[nH]c4c23)[C@H](O)[C@@H](O)[C@@H]1O
InChI Key InChIKey=FPRAZRDYTZXMOW-PFELOJGESA-N
Data  2 EC50
  Tab Delimited (TSV)   2D SDfile   Computed 3D by Vconf -m prep SDfile
Find this compound or compounds like it in BindingDB:
Activity Spreadsheet -- Enzyme Inhibition Constant Data from BindingDB
Found 2 hits for monomerid = 50249677
TargetDNA topoisomerase 1(Homo sapiens (Human))
Tsukuba Research Institute
Curated by ChEMBL
LigandPNGBDBM50249677(2,10-Dihydroxy-6-[(quinolin-3-ylmethyl)amino]-13-(...)
Affinity DataEC50:  30nM. Assay description: Inhibition of human DNA topoisomerase 1-mediated DNA cleavage assessed as relaxation of supercoiled pBR322 plasmid DNA after 15 mins by densitometer
In DepthDetails ArticlePubMed
TargetDNA topoisomerase 1(Mus musculus)
Tsukuba Research Institute
Curated by ChEMBL
LigandPNGBDBM50249677(2,10-Dihydroxy-6-[(quinolin-3-ylmethyl)amino]-13-(...)
Affinity DataEC50: >1.00E+4nM. Assay description: Inhibition of DNA topoisomerase 1 in mouse P388/S cells assessed as formation of topoisomerase 1-DNA complex by protinase K/SDS method
In DepthDetails ArticlePubMed