BDBM50250650 CHEMBL4066429::US10961200, Compound 157::US11247971, Cmpd ID 157
SMILES NS(=O)(=O)c1ccc(Cc2c(nn(-c3nc(cs3)C(O)=O)c2-c2cccnc2)-c2ccccc2)cc1
InChI Key InChIKey=WNLCPKGSLCCXOI-UHFFFAOYSA-N
Data  8 IC50
  Tab Delimited (TSV)   2D SDfile   Computed 3D by Vconf -m prep SDfile
Find this compound or compounds like it in BindingDB:
Activity Spreadsheet -- Enzyme Inhibition Constant Data from BindingDB
Found 8 hits for monomerid = 50250650
TargetL-lactate dehydrogenase B chain(Homo sapiens (Human))
National Center For Advancing Translational Sciences
Curated by ChEMBL
LigandPNGBDBM50250650(CHEMBL4066429 | US10961200, Compound 157 | US11247...)
Affinity DataIC50:  259nM. Assay description: Inhibition of human erythrocytes LDHB using sodium pyruvate as substrate after 5 mins in presence of NAPDH by diaphorase/resazurin based fluorescence...
In DepthDetails ArticlePubMed
TargetIsocitrate dehydrogenase [NADP] cytoplasmic(Homo sapiens (Human))
National Center For Advancing Translational Sciences
Curated by ChEMBL
LigandPNGBDBM50250650(CHEMBL4066429 | US10961200, Compound 157 | US11247...)
Affinity DataIC50: >5.70E+4nM. Assay description: Inhibition of wild type IDH1 (unknown origin) using isocitrate as substrate preincubated for 30 mins followed by substrate addition in presence of NA...
In DepthDetails ArticlePubMed
TargetL-lactate dehydrogenase A chain(Homo sapiens (Human))
National Center For Advancing Translational Sciences
Curated by ChEMBL
LigandPNGBDBM50250650(CHEMBL4066429 | US10961200, Compound 157 | US11247...)
Affinity DataIC50:  349nM. Assay description: Inhibition of human liver LDHA using sodium pyruvate as substrate after 5 mins in presence of NAPDH and EDTA by diaphorase/resazurin based fluorescen...
In DepthDetails ArticlePubMed
TargetL-lactate dehydrogenase A chain(Homo sapiens (Human))
National Center For Advancing Translational Sciences
Curated by ChEMBL
LigandPNGBDBM50250650(CHEMBL4066429 | US10961200, Compound 157 | US11247...)
Affinity DataIC50:  550nM. Assay description: Test compounds were placed in a Greiner Bio-One (Monroe, N.C.) 1536-well black solid bottom assay plate. 200 millimolar (mM) Tris HCl, pH 7.4, 100 mi...
In DepthDetails US Patent
TargetL-lactate dehydrogenase A chain(Homo sapiens (Human))
National Center For Advancing Translational Sciences
Curated by ChEMBL
LigandPNGBDBM50250650(CHEMBL4066429 | US10961200, Compound 157 | US11247...)
Affinity DataIC50:  349nM. Assay description: Inhibition of human liver LDHA using sodium pyruvate as substrate after 5 mins in presence of NAPDH and in absence of EDTA by diaphorase/resazurin ba...
In DepthDetails ArticlePubMed
TargetL-lactate dehydrogenase A chain(Homo sapiens (Human))
National Center For Advancing Translational Sciences
Curated by ChEMBL
LigandPNGBDBM50250650(CHEMBL4066429 | US10961200, Compound 157 | US11247...)
Affinity DataIC50:  2.66E+4nM. Assay description: Inhibition of LDH in human MIAPaCa2 cells assessed as reduction in lactate production preincubated for 2 hrs measured after 30 mins by high throughpu...
In DepthDetails ArticlePubMed
TargetL-lactate dehydrogenase A chain(Homo sapiens (Human))
National Center For Advancing Translational Sciences
Curated by ChEMBL
LigandPNGBDBM50250650(CHEMBL4066429 | US10961200, Compound 157 | US11247...)
Affinity DataIC50:  550nM. Assay description: Test compounds were placed in a Greiner Bio-One (Monroe, N.C.) 1536-well black solid bottom assay plate. 200 millimolar (mM) Tris HCl, pH 7.4, 100 mi...
In DepthDetails US Patent
TargetL-lactate dehydrogenase A chain(Homo sapiens (Human))
National Center For Advancing Translational Sciences
Curated by ChEMBL
LigandPNGBDBM50250650(CHEMBL4066429 | US10961200, Compound 157 | US11247...)
Affinity DataIC50:  349nM. Assay description: Inhibition of human liver LDHA using sodium pyruvate as substrate after 5 mins in presence of NAPDH and EDTA by diaphorase/resazurin based fluorescen...
In DepthDetails ArticlePubMed