BDBM50250776 CHEMBL4069661
SMILES Cc1ncccc1COc1cc(F)c(c(F)c1)-c1ccnc(c1)N1CCNCC1
InChI Key InChIKey=CBTYKTDJZYPPTF-UHFFFAOYSA-N
Data  1 IC50
  Tab Delimited (TSV)   2D SDfile   Computed 3D by Vconf -m prep SDfile
Find this compound or compounds like it in BindingDB:
Activity Spreadsheet -- Enzyme Inhibition Constant Data from BindingDB
Found 1 hit for monomerid = 50250776
TargetGlycylpeptide N-tetradecanoyltransferase 1(Homo sapiens (Human))
University Of Dundee
Curated by ChEMBL
LigandPNGBDBM50250776(CHEMBL4069661)
Affinity DataIC50:  30nM. Assay description: Inhibition of human NMT1 using [3H]-myristoyl-coA/biotinylated CAP5.5 as substrate after 15 mins by scintillation/luminescence counting method
Ligand InfoPC cidPC sid
In DepthDetails ArticlePubMed