BDBM50250777 CHEMBL4080376
SMILES Cc1ncccc1COc1cc(F)c(cc1F)-c1ccnc(c1)N1CCNCC1
InChI Key InChIKey=PEBIYIKQLNHXNV-UHFFFAOYSA-N
Data  1 IC50
  Tab Delimited (TSV)   2D SDfile   Computed 3D by Vconf -m prep SDfile
Find this compound or compounds like it in BindingDB:
Activity Spreadsheet -- Enzyme Inhibition Constant Data from BindingDB
Found 1 hit for monomerid = 50250777
TargetGlycylpeptide N-tetradecanoyltransferase 1(Homo sapiens (Human))
University Of Dundee
Curated by ChEMBL
LigandPNGBDBM50250777(CHEMBL4080376)
Affinity DataIC50:  10nM. Assay description: Inhibition of human NMT1 using [3H]-myristoyl-coA/biotinylated CAP5.5 as substrate after 15 mins by scintillation/luminescence counting method
In DepthDetails ArticlePubMed