BDBM50252067 4-[(4-Methoxybenzyl)thio]-7-(beta-D-ribofuranosyl)-7H-pyrrolo[2,3-d]pyrimidine::CHEMBL480000
SMILES COc1ccc(CSc2ncnc3n(ccc23)[C@@H]2O[C@H](CO)[C@@H](O)[C@H]2O)cc1
InChI Key InChIKey=SETRXOQXMWXYMD-YKTARERQSA-N
Data  1 KI
  Tab Delimited (TSV)   2D SDfile   Computed 3D by Vconf -m prep SDfile
Find this compound or compounds like it in BindingDB:
Activity Spreadsheet -- Enzyme Inhibition Constant Data from BindingDB
Found 1 hit for monomerid = 50252067
TargetAdenosine kinase(Toxoplasma gondii)
University Of Georgia
Curated by ChEMBL
LigandPNGBDBM50252067(4-[(4-Methoxybenzyl)thio]-7-(beta-D-ribofuranosyl)...)
Affinity DataKi:  5.80E+3nM. Assay description: Binding affinity to purified Toxoplasma gondii adenosine kinase
In DepthDetails ArticlePubMed