BDBM50253926 (2-amino-4-((4-(benzo[d][1,3]dioxol-5-yl)piperazin-1-yl)methyl)thiophen-3-yl)(4-chlorophenyl)methanone::CHEMBL518345
SMILES Nc1scc(CN2CCN(CC2)c2ccc3OCOc3c2)c1C(=O)c1ccc(Cl)cc1
InChI Key InChIKey=VETJLOKKGTWBFO-UHFFFAOYSA-N
Data  2 Kd
  Tab Delimited (TSV)   2D SDfile   Computed 3D by Vconf -m prep SDfile
Find this compound or compounds like it in BindingDB:
Activity Spreadsheet -- Enzyme Inhibition Constant Data from BindingDB
Found 2 hits for monomerid = 50253926
TargetAdenosine receptor A1(Homo sapiens (Human))
Dipartimento Di Scienze Farmaceutiche
Curated by ChEMBL
LigandPNGBDBM50253926((2-amino-4-((4-(benzo[d][1,3]dioxol-5-yl)piperazin...)
Affinity DataKd:  1.10nM. Assay description: Displacement of [3H]CCPA from human adenosine A1 receptor expressed in CHO cells
In DepthDetails ArticlePubMed
TargetAdenosine receptor A1(Homo sapiens (Human))
Dipartimento Di Scienze Farmaceutiche
Curated by ChEMBL
LigandPNGBDBM50253926((2-amino-4-((4-(benzo[d][1,3]dioxol-5-yl)piperazin...)
Affinity DataKd:  1.90nM. Assay description: Displacement of [3H]DPCPX from human adenosine A1 receptor expressed in CHO cells
In DepthDetails ArticlePubMed