BDBM50256783 CHEMBL474634::trans-[2-(2-Chloro-6-methylphenyl)cyclopropyl]methylamine Hydrochloride
SMILES Cc1cccc(Cl)c1[C@H]1C[C@@H]1CN
InChI Key InChIKey=VMWCRTICMSOLFF-BDAKNGLRSA-N
Data  3 EC50
  Tab Delimited (TSV)   2D SDfile   Computed 3D by Vconf -m prep SDfile
Find this compound or compounds like it in BindingDB:
Activity Spreadsheet -- Enzyme Inhibition Constant Data from BindingDB
Found 3 hits for monomerid = 50256783
Target5-hydroxytryptamine receptor 2A(Homo sapiens (Human))
University Of Illinois At Chicago
Curated by ChEMBL
LigandPNGBDBM50256783(CHEMBL474634 | trans-[2-(2-Chloro-6-methylphenyl)c...)
Affinity DataEC50:  726nM. Assay description: Agonist activity at human 5HT2A receptor expressed in HEK293 cells assessed as calcium flux by FLIPR assay
In DepthDetails ArticlePubMed
Target5-hydroxytryptamine receptor 2C(Homo sapiens (Human))
University Of Illinois At Chicago
Curated by ChEMBL
LigandPNGBDBM50256783(CHEMBL474634 | trans-[2-(2-Chloro-6-methylphenyl)c...)
Affinity DataEC50:  3.5nM. Assay description: Agonist activity at human 5HT2C receptor expressed in HEK293 cells assessed as calcium flux by FLIPR assay
In DepthDetails ArticlePubMed
Target5-hydroxytryptamine receptor 2B(Homo sapiens (Human))
University Of Illinois At Chicago
Curated by ChEMBL
LigandPNGBDBM50256783(CHEMBL474634 | trans-[2-(2-Chloro-6-methylphenyl)c...)
Affinity DataEC50:  7nM. Assay description: Agonist activity at human 5HT2B receptor expressed in HEK293 cells assessed as calcium flux by FLIPR assay
In DepthDetails ArticlePubMed