BDBM50257173 (S)-benzyl 1-(1H-benzo[d]imidazol-2-yl)-5-(sulfamoylamino)pentylcarbamate::CHEMBL494331
SMILES NS(=O)(=O)NCCCC[C@H](NC(=O)OCc1ccccc1)c1nc2ccccc2[nH]1
InChI Key InChIKey=DZSSEYYBKOEZBO-SFHVURJKSA-N
Data  2 IC50
  Tab Delimited (TSV)   2D SDfile   Computed 3D by Vconf -m prep SDfile
Find this compound or compounds like it in BindingDB:
Activity Spreadsheet -- Enzyme Inhibition Constant Data from BindingDB
Found 2 hits for monomerid = 50257173
TargetHistone deacetylase 6(Homo sapiens (Human))
Methylgene
Curated by ChEMBL
LigandPNGBDBM50257173((S)-benzyl 1-(1H-benzo[d]imidazol-2-yl)-5-(sulfamo...)
Affinity DataIC50:  100nM. Assay description: Inhibition of human recombinant His-tagged HDAC6 expressed in baculovirus
In DepthDetails ArticlePubMed
TargetHistone deacetylase 1(Homo sapiens (Human))
Methylgene
Curated by ChEMBL
LigandPNGBDBM50257173((S)-benzyl 1-(1H-benzo[d]imidazol-2-yl)-5-(sulfamo...)
Affinity DataIC50:  2.90E+3nM. Assay description: Inhibition of human recombinant FLAG-tagged HDAC1 expressed in baculovirus
In DepthDetails ArticlePubMed