BDBM50257517 CHEMBL4093657
SMILES COc1ccc(CNc2ccc(cc2)-c2ccn3c(CC4CC4)nnc3c2C(F)(F)F)cn1
InChI Key InChIKey=YCNAZWWKISZLST-UHFFFAOYSA-N
Data  1 KI  1 Kd  1 EC50
  Tab Delimited (TSV)   2D SDfile   Computed 3D by Vconf -m prep SDfile
Find this compound or compounds like it in BindingDB:
Activity Spreadsheet -- Enzyme Inhibition Constant Data from BindingDB
Found 3 hits for monomerid = 50257517
TargetMetabotropic glutamate receptor 2(Homo sapiens (Human))
Leiden University
Curated by ChEMBL
LigandPNGBDBM50257517(CHEMBL4093657)
Affinity DataKi:  3.20nM. Assay description: Positive allosteric modulation of human metabotropic glutamate receptor 2 expressed in CHOK1 cell membranes assessed as increase in glutamate-induced...
In DepthDetails ArticlePubMed
TargetMetabotropic glutamate receptor 2(Homo sapiens (Human))
Leiden University
Curated by ChEMBL
LigandPNGBDBM50257517(CHEMBL4093657)
Affinity DataKd:  2nM. Assay description: Displacement of [3H]-JNJ46281222 from human metabotropic glutamate receptor 2 expressed in CHOK1 cell membranes after 60 mins by microbeta counting a...
In DepthDetails ArticlePubMed
TargetMetabotropic glutamate receptor 2(Homo sapiens (Human))
Leiden University
Curated by ChEMBL
LigandPNGBDBM50257517(CHEMBL4093657)
Affinity DataEC50:  15nM. Assay description: Positive allosteric modulation of human metabotropic glutamate receptor 2 expressed in CHOK1 cell membranes assessed as increase in glutamate-induced...
In DepthDetails ArticlePubMed