BDBM50258610 1-(3-methoxybenzyl)-5-(trifluoromethoxy)indoline-2,3-dione::CHEMBL469144
SMILES COc1cccc(CN2C(=O)C(=O)c3cc(OC(F)(F)F)ccc23)c1
InChI Key InChIKey=MPWSPRAQUFVMBN-UHFFFAOYSA-N
Data  2 EC50
  Tab Delimited (TSV)   2D SDfile   Computed 3D by Vconf -m prep SDfile
Find this compound or compounds like it in BindingDB:
Activity Spreadsheet -- Enzyme Inhibition Constant Data from BindingDB
Found 2 hits for monomerid = 50258610
TargetMuscarinic acetylcholine receptor M5(Homo sapiens (Human))
Vanderbilt University Medical Center
Curated by ChEMBL
LigandPNGBDBM50258610(1-(3-methoxybenzyl)-5-(trifluoromethoxy)indoline-2...)
Affinity DataEC50:  1.70E+3nM. Assay description: Activation of human muscarinic M5 receptor expressed in CHO cells coexpressing Gq protein assessed as potentiation of acetylcholine-induced intracell...
In DepthDetails ArticlePubMed
TargetMuscarinic acetylcholine receptor M1(RAT)
Vanderbilt University Medical Center
Curated by ChEMBL
LigandPNGBDBM50258610(1-(3-methoxybenzyl)-5-(trifluoromethoxy)indoline-2...)
Affinity DataEC50: >3.00E+4nM. Assay description: Activation of rat muscarinic M1 receptor expressed in CHO cells coexpressing Gq protein assessed as potentiation of acetylcholine-induced intracellul...
In DepthDetails ArticlePubMed