BDBM50258896 CHEMBL4060569::US11419874, TAK-915
SMILES COC[C@@H](NC(=O)N1CC(=O)Nc2cc(OC)cnc12)c1ccc(OC(F)(F)F)c(F)c1
InChI Key InChIKey=AWJSRXUQLSPAOI-CQSZACIVSA-N
Data  12 IC50
PDB links: 1 PDB ID matches this monomer.
  Tab Delimited (TSV)   2D SDfile   Computed 3D by Vconf -m prep SDfile
Find this compound or compounds like it in BindingDB:
Activity Spreadsheet -- Enzyme Inhibition Constant Data from BindingDB
Found 12 hits for monomerid = 50258896
LigandPNGBDBM50258896(CHEMBL4060569 | US11419874, TAK-915)
Affinity DataIC50:  2.50E+3nM. Assay description: Inhibition of recombinant human full-length N-terminal GST-tagged PDE1A expressed in baculovirus infected fall armyworm Sf9 cells using [3H]cGMP as s...
In DepthDetails ArticlePubMed
TargetcGMP-inhibited 3',5'-cyclic phosphodiesterase 3A(Homo sapiens (Human))
Takeda Pharmaceutical
Curated by ChEMBL
LigandPNGBDBM50258896(CHEMBL4060569 | US11419874, TAK-915)
Affinity DataIC50: >3.00E+4nM. Assay description: Inhibition of recombinant human N-terminal GST-tagged PDE3A (669 to 1141 residues) expressed in baculovirus infected fall armyworm Sf9 cells using [3...
In DepthDetails ArticlePubMed
TargetcGMP-specific 3',5'-cyclic phosphodiesterase(Homo sapiens (Human))
Takeda Pharmaceutical
Curated by ChEMBL
LigandPNGBDBM50258896(CHEMBL4060569 | US11419874, TAK-915)
Affinity DataIC50: >3.00E+4nM. Assay description: Inhibition of recombinant human full length N-terminal GST-tagged PDE5A1 expressed in baculovirus infected fall armyworm Sf9 cells using [3H]cGMP as ...
In DepthDetails ArticlePubMed
TargetcAMP-specific 3',5'-cyclic phosphodiesterase 7B(Homo sapiens (Human))
Takeda Pharmaceutical
Curated by ChEMBL
LigandPNGBDBM50258896(CHEMBL4060569 | US11419874, TAK-915)
Affinity DataIC50: >3.00E+4nM. Assay description: Inhibition of human N-terminal GST/C-terminal His-tagged PDE7B (109 to end residues) expressed in baculovirus infected fall armyworm Sf9 cells using ...
In DepthDetails ArticlePubMed
TargetHigh affinity cGMP-specific 3',5'-cyclic phosphodiesterase 9A(Homo sapiens (Human))
Takeda Pharmaceutical
Curated by ChEMBL
LigandPNGBDBM50258896(CHEMBL4060569 | US11419874, TAK-915)
Affinity DataIC50: >3.00E+4nM. Assay description: Inhibition of recombinant human full length N-terminal GST-tagged PDE9A2 expressed in baculovirus infected fall armyworm Sf9 cells using [3H]cGMP as ...
In DepthDetails ArticlePubMed
TargetcGMP-dependent 3',5'-cyclic phosphodiesterase(Homo sapiens (Human))
Oslo University Hospital
US Patent
LigandPNGBDBM50258896(CHEMBL4060569 | US11419874, TAK-915)
Affinity DataIC50:  0.610nM. Assay description: Isolated cardiomyocytes were washed twice in PBS at room temperature, transferred to 4% paraformaldehyde (PFA) and gently shaken for 30 min, then was...
TargetDual 3',5'-cyclic-AMP and -GMP phosphodiesterase 11A(Homo sapiens (Human))
Takeda Pharmaceutical
Curated by ChEMBL
LigandPNGBDBM50258896(CHEMBL4060569 | US11419874, TAK-915)
Affinity DataIC50: >3.00E+4nM. Assay description: Inhibition of recombinant human full length N-terminal GST-tagged PDE11A4 expressed in baculovirus infected fall armyworm Sf9 cells using [3H]cGMP as...
In DepthDetails ArticlePubMed
TargetcGMP-dependent 3',5'-cyclic phosphodiesterase(Homo sapiens (Human))
Oslo University Hospital
US Patent
LigandPNGBDBM50258896(CHEMBL4060569 | US11419874, TAK-915)
Affinity DataIC50:  0.610nM. Assay description: Inhibition of recombinant human full-length His-tagged PDE2A3 expressed in fall armyworm Sf9 cells using [3H]cGMP as substrate preincubated for 30 mi...
TargetcAMP-specific 3',5'-cyclic phosphodiesterase 4D(Homo sapiens (Human))
Takeda Pharmaceutical
Curated by ChEMBL
LigandPNGBDBM50258896(CHEMBL4060569 | US11419874, TAK-915)
Affinity DataIC50:  1.49E+4nM. Assay description: Inhibition of recombinant human N-terminal GST-tagged PDE4D2 (2 to 507 residues) expressed in baculovirus infected fall armyworm Sf9 cells using [3H]...
In DepthDetails ArticlePubMed
TargetHigh affinity cAMP-specific and IBMX-insensitive 3',5'-cyclic phosphodiesterase 8A(Homo sapiens (Human))
Takeda Pharmaceutical
Curated by ChEMBL
LigandPNGBDBM50258896(CHEMBL4060569 | US11419874, TAK-915)
Affinity DataIC50: >3.00E+4nM. Assay description: Inhibition of recombinant human full length N-terminal GST-tagged PDE8A1 expressed in baculovirus infected fall armyworm Sf9 cells using [3H]cAMP as ...
In DepthDetails ArticlePubMed
TargetRod cGMP-specific 3',5'-cyclic phosphodiesterase subunit alpha/beta(Homo sapiens (Human))
Takeda Pharmaceutical
Curated by ChEMBL
LigandPNGBDBM50258896(CHEMBL4060569 | US11419874, TAK-915)
Affinity DataIC50: >3.00E+4nM. Assay description: Inhibition of recombinant human full length N-terminal GST-tagged PDE11A4 expressed in baculovirus infected fall armyworm Sf9 cells using [3H]cGMP as...
In DepthDetails ArticlePubMed
TargetcAMP and cAMP-inhibited cGMP 3',5'-cyclic phosphodiesterase 10A(Homo sapiens (Human))
Takeda Pharmaceutical
Curated by ChEMBL
LigandPNGBDBM50258896(CHEMBL4060569 | US11419874, TAK-915)
Affinity DataIC50: >3.00E+4nM. Assay description: Inhibition of recombinant human full length PDE10A2 transfected in African green monkey COS7 cells using [3H]cGMP as substrate preincubated for 30 mi...
In DepthDetails ArticlePubMed