BDBM50259932 5-[10'(Z)-heptadecenyljresorcinol::CHEMBL476083
SMILES CCCCCC\C=C/CCCCCCCCCc1cc(O)cc(O)c1
InChI Key InChIKey=VBBLHZOJAWSCSP-FPLPWBNLSA-N
Data  1 IC50
  Tab Delimited (TSV)   2D SDfile   Computed 3D by Vconf -m prep SDfile
Find this compound or compounds like it in BindingDB:
Activity Spreadsheet -- Enzyme Inhibition Constant Data from BindingDB
Found 1 hit for monomerid = 50259932
Target1-phosphatidylinositol 4,5-bisphosphate phosphodiesterase gamma-1(Bos taurus)
Seoul National University
Curated by ChEMBL
LigandPNGBDBM50259932(5-[10'(Z)-heptadecenyljresorcinol | CHEMBL476083)
Affinity DataIC50:  3.06E+4nM. Assay description: Inhibition of bovine brain PI-PLCgamma1
In DepthDetails ArticlePubMed