BDBM50262004 CHEMBL4088763
SMILES CN(C(=O)Cn1cc(cn1)-c1nc(no1)C1(CCC1)c1ccc(cc1)-c1cnc(N)nc1)C(C)(C)C
InChI Key InChIKey=QQMWGYNYECAVOI-UHFFFAOYSA-N
Data  2 IC50
  Tab Delimited (TSV)   2D SDfile   Computed 3D by Vconf -m prep SDfile
Find this compound or compounds like it in BindingDB:
Activity Spreadsheet -- Enzyme Inhibition Constant Data from BindingDB
Found 2 hits for monomerid = 50262004
TargetArachidonate 5-lipoxygenase-activating protein(Homo sapiens (Human))
Boehringer Ingelheim Pharmaceuticals
Curated by ChEMBL
LigandPNGBDBM50262004(CHEMBL4088763)
Affinity DataIC50:  27nM. Assay description: Displacement of [125I]-L-691831 from human FLAP expressed in Sf9 cell membranes after 2 hrs by Topcount method
In DepthDetails ArticlePubMed
TargetArachidonate 5-lipoxygenase-activating protein(Homo sapiens (Human))
Boehringer Ingelheim Pharmaceuticals
Curated by ChEMBL
LigandPNGBDBM50262004(CHEMBL4088763)
Affinity DataIC50:  1nM. Assay description: Displacement of [125I]-L-691831 from human FLAP expressed in Sf9 cell membranes after 2 hrs by Topcount method
In DepthDetails ArticlePubMed