BDBM50262181 CHEMBL4064879
SMILES Cc1nnc2c(Nc3cccc(CNC(=O)OC(C)(C)C)c3)nccn12
InChI Key InChIKey=IZCRCGCVZZYCCP-UHFFFAOYSA-N
Data  1 IC50
  Tab Delimited (TSV)   2D SDfile   Computed 3D by Vconf -m prep SDfile
Find this compound or compounds like it in BindingDB:
Activity Spreadsheet -- Enzyme Inhibition Constant Data from BindingDB
Found 1 hit for monomerid = 50262181
TargetBromodomain-containing protein 4(Homo sapiens (Human))
Korea Research Institute Of Chemical Technology
Curated by ChEMBL
LigandPNGBDBM50262181(CHEMBL4064879)
Affinity DataIC50:  1.50E+3nM. Assay description: Inhibition of BRD4 BD1-BD2 (unknown origin) using tetraacetylated histone peptide as substrate after 2 hrs by alphascreen assay
In DepthDetails ArticlePubMed