BDBM50262440 2-Amino-6-phenyl-4-thiophen-2-yl-nicotinonitrile::CHEMBL476298
SMILES Nc1nc(cc(-c2cccs2)c1C#N)-c1ccccc1
InChI Key InChIKey=WFWGQLLRRFDTHC-UHFFFAOYSA-N
Data  2 KI
  Tab Delimited (TSV)   2D SDfile   Computed 3D by Vconf -m prep SDfile
Find this compound or compounds like it in BindingDB:
Activity Spreadsheet -- Enzyme Inhibition Constant Data from BindingDB
Found 2 hits for monomerid = 50262440
TargetAdenosine receptor A1(Homo sapiens (Human))
Leiden/Amsterdam Center For Drug Research
Curated by ChEMBL
LigandPNGBDBM50262440(2-Amino-6-phenyl-4-thiophen-2-yl-nicotinonitrile |...)
Affinity DataKi:  22nM. Assay description: Displacement of [3H]DPCPX from human adenosine A1 receptor expressed in CHO cell membrane
In DepthDetails ArticlePubMed
TargetAdenosine receptor A2a(Homo sapiens (Human))
Leiden/Amsterdam Center For Drug Research
Curated by ChEMBL
LigandPNGBDBM50262440(2-Amino-6-phenyl-4-thiophen-2-yl-nicotinonitrile |...)
Affinity DataKi:  54nM. Assay description: Displacement of [3H]ZM241385 from human adenosine A2A receptor expressed in HEK293 cell membrane
In DepthDetails ArticlePubMed