BDBM50264378 CHEMBL4098026
SMILES CS(=O)(=O)c1cc(ccc1C(=O)C(C#N)C(=O)C1CC1)C(F)(F)F
InChI Key InChIKey=ZTTKDUXKVPEXCG-UHFFFAOYSA-N
Data  1 Kd
  Tab Delimited (TSV)   2D SDfile   Computed 3D by Vconf -m prep SDfile
Find this compound or compounds like it in BindingDB:
Activity Spreadsheet -- Enzyme Inhibition Constant Data from BindingDB
Found 1 hit for monomerid = 50264378
Target4-hydroxyphenylpyruvate dioxygenase(Daucus carota)
Universit£
Curated by ChEMBL
LigandPNGBDBM50264378(CHEMBL4098026)
Affinity DataKd:  6nM. Assay description: Inhibition of carrot HPPD expressed in Escherichia coli JM105 using HPPA as substrate
In DepthDetails ArticlePubMed