BDBM50265735 CHEMBL4073649
SMILES Fc1ccc(cc1)-n1ncc2C[C@@]3(CN(CCC3=Cc12)S(=O)(=O)c1ccc(F)c(F)c1)C(=O)c1nccs1
InChI Key InChIKey=SKSXFFSIYMFQNH-SANMLTNESA-N
Data  2 KI
  Tab Delimited (TSV)   2D SDfile   Computed 3D by Vconf -m prep SDfile
Find this compound or compounds like it in BindingDB:
Activity Spreadsheet -- Enzyme Inhibition Constant Data from BindingDB
Found 2 hits for monomerid = 50265735
TargetGlucocorticoid receptor(Homo sapiens (Human))
Corcept Therapeutics
Curated by ChEMBL
LigandPNGBDBM50265735(CHEMBL4073649)
Affinity DataKi:  0.230nM. Assay description: Displacement of fluormone GS Red from human glucocorticoid receptor after 4 hrs by fluorescence polarization assay
In DepthDetails ArticlePubMed
TargetGlucocorticoid receptor(Homo sapiens (Human))
Corcept Therapeutics
Curated by ChEMBL
LigandPNGBDBM50265735(CHEMBL4073649)
Affinity DataKi:  37nM. Assay description: Antagonist activity at glucocorticoid receptor in human HepG2 cells assessed as inhibition of dexamethasone-induced tyrosine amino transferase activi...
In DepthDetails ArticlePubMed