BDBM50266265 CHEMBL4065035
SMILES COCC[S+]([O-])c1sc2nc(cc(-c3cnc(C)n3C)c2c1N)-c1nccs1
InChI Key InChIKey=CODOEAGTQUBEHK-UHFFFAOYSA-N
Data  1 IC50
  Tab Delimited (TSV)   2D SDfile   Computed 3D by Vconf -m prep SDfile
Find this compound or compounds like it in BindingDB:
Activity Spreadsheet -- Enzyme Inhibition Constant Data from BindingDB
Found 1 hit for monomerid = 50266265
Target15-hydroxyprostaglandin dehydrogenase [NAD(+)](Homo sapiens (Human))
Ut Southwestern Medical Center
Curated by ChEMBL
LigandPNGBDBM50266265(CHEMBL4065035)
Affinity DataIC50:  1.80nM. Assay description: Inhibition of recombinant human C-terminal 6xHis-tagged 15-PGDH expressed in Escherichia coli using PGE2 as substrate after 15 mins in presence of NA...
In DepthDetails ArticlePubMed