BDBM50266400 CHEMBL4072794
SMILES NS(=O)(=O)Oc1ccc(-c2ccc(s2)C(=O)c2c(F)ccc(O)c2F)c(F)c1Cl
InChI Key InChIKey=WIEBHCIFEMWCFQ-UHFFFAOYSA-N
Data  3 IC50
  Tab Delimited (TSV)   2D SDfile   Computed 3D by Vconf -m prep SDfile
Find this compound or compounds like it in BindingDB:
Activity Spreadsheet -- Enzyme Inhibition Constant Data from BindingDB
Found 3 hits for monomerid = 50266400
TargetSteryl-sulfatase(Homo sapiens (Human))
Saarland University
Curated by ChEMBL
LigandPNGBDBM50266400(CHEMBL4072794)
Affinity DataIC50:  245nM. Assay description: Inhibition of human placental microsomal STS assessed as formation of E1 preincubated for 30 mins followed by addition of E1S as substrate measured a...
In DepthDetails ArticlePubMed
Target17-beta-hydroxysteroid dehydrogenase type 2(Homo sapiens (Human))
Saarland University
Curated by ChEMBL
LigandPNGBDBM50266400(CHEMBL4072794)
Affinity DataIC50:  18nM. Assay description: Inhibition of human placental cytosolic 17beta-HSD2 using [3H]-E2/E2 substrate and NAD+ after 20 mins by HPLC based radio-detection method
In DepthDetails ArticlePubMed
Target17-beta-hydroxysteroid dehydrogenase type 1(Homo sapiens (Human))
Saarland University
Curated by ChEMBL
LigandPNGBDBM50266400(CHEMBL4072794)
Affinity DataIC50:  1.40nM. Assay description: Inhibition of human placental cytosolic 17beta-HSD1 using [3H]-E1/E1 substrate and NADH after 10 mins by HPLC based radio-detection method
In DepthDetails ArticlePubMed