BDBM50268885 CHEMBL4084508
SMILES COc1cc2nc(nc(NC3CCN(C)CC3)c2cc1OC)N(C)C(C)C
InChI Key InChIKey=RINVPEJSDRLKKC-UHFFFAOYSA-N
Data  2 IC50
  Tab Delimited (TSV)   2D SDfile   Computed 3D by Vconf -m prep SDfile
Find this compound or compounds like it in BindingDB:
Activity Spreadsheet -- Enzyme Inhibition Constant Data from BindingDB
Found 2 hits for monomerid = 50268885
TargetHistone-lysine N-methyltransferase EHMT2(Homo sapiens (Human))
Icahn School Of Medicine At Mount Sinai
Curated by ChEMBL
LigandPNGBDBM50268885(CHEMBL4084508)
Affinity DataIC50:  318nM. Assay description: Inhibition of human G9a catalytic domain (913 to 1193 residues) expressed in Escherichia coli BL21 (DE3) using biotinylated H3 (1 to 25 residues) as ...
Ligand InfoPC cidPC sid
In DepthDetails ArticlePubMed
TargetHistone-lysine N-methyltransferase EHMT1(Homo sapiens (Human))
Icahn School Of Medicine At Mount Sinai
Curated by ChEMBL
LigandPNGBDBM50268885(CHEMBL4084508)
Affinity DataIC50:  18nM. Assay description: Inhibition of human GLP catalytic domain (951 to 1235 residues) expressed in Escherichia coli BL21 (DE3) using biotinylated H3 (1 to 25 residues) as ...
Ligand InfoPC cidPC sid
In DepthDetails ArticlePubMed