BDBM50279454 1-(2,3-dihydro-6-propoxychromen-4-ylideneamino)-3-(3-(4-methylpiperazin-1-yl)propyl)imidazolidine-2,4-dione::CHEMBL520069
SMILES CCCOc1ccc2OCCC(=Nn3cc(O)n(CCCN4CCN(C)CC4)c3=O)c2c1
InChI Key InChIKey=SPELJYDGJYGCDC-UHFFFAOYSA-N
Data  2 IC50
  Tab Delimited (TSV)   2D SDfile   Computed 3D by Vconf -m prep SDfile
Find this compound or compounds like it in BindingDB:
Activity Spreadsheet -- Enzyme Inhibition Constant Data from BindingDB
Found 2 hits for monomerid = 50279454
TargetPotassium voltage-gated channel subfamily KQT member 1(Cavia porcellus)
China Pharmaceutical University
Curated by ChEMBL
LigandPNGBDBM50279454(1-(2,3-dihydro-6-propoxychromen-4-ylideneamino)-3-...)
Affinity DataIC50:  9.5nM. Assay description: Inhibition of KVLQT1/minK in guinea pig ventricular myocytes assessed as blockade of slow delayed rectifier potassium current by whole cell patch-cla...
In DepthDetails ArticlePubMed
TargetPotassium voltage-gated channel subfamily H member 2(Cavia porcellus)
China Pharmaceutical University
Curated by ChEMBL
LigandPNGBDBM50279454(1-(2,3-dihydro-6-propoxychromen-4-ylideneamino)-3-...)
Affinity DataIC50:  106nM. Assay description: Inhibition of ERG in guinea pig ventricular myocytes assessed as blockade of rapid delayed rectifier potassium current by whole cell patch-clamp tech...
In DepthDetails ArticlePubMed