BDBM50279741 1-(6-butoxy-2,3-dihydrochromen-4-ylideneamino)-3-(4-(piperidin-1-yl)butyl)imidazolidine-2,4-dione::CHEMBL475725
SMILES CCCCOc1ccc2OCCC(=Nn3cc(O)n(CCCCN4CCCCC4)c3=O)c2c1
InChI Key InChIKey=BKMUZKOHDPZRCC-UHFFFAOYSA-N
Data  2 IC50
  Tab Delimited (TSV)   2D SDfile   Computed 3D by Vconf -m prep SDfile
Find this compound or compounds like it in BindingDB:
Activity Spreadsheet -- Enzyme Inhibition Constant Data from BindingDB
Found 2 hits for monomerid = 50279741
TargetPotassium voltage-gated channel subfamily H member 2(Cavia porcellus)
China Pharmaceutical University
Curated by ChEMBL
LigandPNGBDBM50279741(1-(6-butoxy-2,3-dihydrochromen-4-ylideneamino)-3-(...)
Affinity DataIC50:  17nM. Assay description: Inhibition of ERG in guinea pig ventricular myocytes assessed as blockade of rapid delayed rectifier potassium current by whole cell patch-clamp tech...
In DepthDetails ArticlePubMed
TargetPotassium voltage-gated channel subfamily KQT member 1(Cavia porcellus)
China Pharmaceutical University
Curated by ChEMBL
LigandPNGBDBM50279741(1-(6-butoxy-2,3-dihydrochromen-4-ylideneamino)-3-(...)
Affinity DataIC50:  1.03E+3nM. Assay description: Inhibition of KVLQT1/minK in guinea pig ventricular myocytes assessed as blockade of slow delayed rectifier potassium current by whole cell patch-cla...
In DepthDetails ArticlePubMed