BDBM50285430 Benzooxazol-2-yl-{5-[4,5-bis-(4-dimethylamino-phenyl)-1H-imidazol-2-ylsulfanyl]-pentyl}-amine::CHEMBL50855
SMILES CN(C)c1ccc(cc1)-c1nc(SCCCCCNc2nc3ccccc3o2)[nH]c1-c1ccc(cc1)N(C)C
InChI Key InChIKey=MYIILNASXHQBLI-UHFFFAOYSA-N
Data  1 IC50
  Tab Delimited (TSV)   2D SDfile   Computed 3D by Vconf -m prep SDfile
Find this compound or compounds like it in BindingDB:
Activity Spreadsheet -- Enzyme Inhibition Constant Data from BindingDB
Found 1 hit for monomerid = 50285430
TargetSterol O-acyltransferase 1(Mus musculus)
TBA
Curated by ChEMBL
LigandPNGBDBM50285430(Benzooxazol-2-yl-{5-[4,5-bis-(4-dimethylamino-phen...)
Affinity DataIC50:  90nM. Assay description: Inhibition of Acyl coenzyme A:cholesterol acyltransferase in J774 Macrophage cell culture
In DepthDetails Article