BDBM50285779 CHEMBL4165205
SMILES COc1cc(cc(OC)c1C)[C@@H](O)[C@@H](CC1Cc2ccccc2C1)Cn1ccc(CCC(O)=O)c1
InChI Key InChIKey=USAXUWZJQPBEDO-ABYGYWHVSA-N
Data  3 IC50  7 Kd
  Tab Delimited (TSV)   2D SDfile   Computed 3D by Vconf -m prep SDfile
Find this compound or compounds like it in BindingDB:
Activity Spreadsheet -- Enzyme Inhibition Constant Data from BindingDB
Found 10 hits for monomerid = 50285779
TargetLysophosphatidic acid receptor 1(Homo sapiens (Human))
Ono Pharmaceutical
Curated by ChEMBL
LigandPNGBDBM50285779(CHEMBL4165205)
Affinity DataIC50:  0.190nM. Assay description: Antagonist activity at recombinant human LPA1 expressed in CHO cell membranes pretreated for 24 hrs prior to Fura-2-AM dye addition for 1 hr followed...
In DepthDetails ArticlePubMed
TargetLysophosphatidic acid receptor 1(Homo sapiens (Human))
Ono Pharmaceutical
Curated by ChEMBL
LigandPNGBDBM50285779(CHEMBL4165205)
Affinity DataKd:  2.30nM. Assay description: Binding affinity to recombinant human LPA1 expressed in CHO cell membranes measured after 0.5 hrs by scintillation counting method
In DepthDetails ArticlePubMed
TargetLysophosphatidic acid receptor 1(Homo sapiens (Human))
Ono Pharmaceutical
Curated by ChEMBL
LigandPNGBDBM50285779(CHEMBL4165205)
Affinity DataKd:  0.740nM. Assay description: Binding affinity to recombinant human LPA1 expressed in CHO cell membranes measured after 2 hrs by scintillation counting method
In DepthDetails ArticlePubMed
TargetLysophosphatidic acid receptor 1(Homo sapiens (Human))
Ono Pharmaceutical
Curated by ChEMBL
LigandPNGBDBM50285779(CHEMBL4165205)
Affinity DataKd:  0.740nM. Assay description: Binding affinity to recombinant human LPA1 expressed in CHO cell membranes measured after 2 hrs at room temperature by scintillation counting method
In DepthDetails ArticlePubMed
TargetLysophosphatidic acid receptor 1(Homo sapiens (Human))
Ono Pharmaceutical
Curated by ChEMBL
LigandPNGBDBM50285779(CHEMBL4165205)
Affinity DataKd:  23nM. Assay description: Binding affinity to recombinant human LPA1 expressed in CHO cell membranes measured after 2 hrs at 4 degC by scintillation counting method
In DepthDetails ArticlePubMed
TargetLysophosphatidic acid receptor 1(Homo sapiens (Human))
Ono Pharmaceutical
Curated by ChEMBL
LigandPNGBDBM50285779(CHEMBL4165205)
Affinity DataKd:  0.490nM. Assay description: Binding affinity to recombinant human LPA1 expressed in CHO cell membranes measured after 4 hrs by scintillation counting method
In DepthDetails ArticlePubMed
TargetLysophosphatidic acid receptor 1(Homo sapiens (Human))
Ono Pharmaceutical
Curated by ChEMBL
LigandPNGBDBM50285779(CHEMBL4165205)
Affinity DataKd:  0.340nM. Assay description: Binding affinity to recombinant human LPA1 expressed in CHO cell membranes measured after 2 hrs at 37 degC by scintillation counting method
In DepthDetails ArticlePubMed
TargetLysophosphatidic acid receptor 1(Homo sapiens (Human))
Ono Pharmaceutical
Curated by ChEMBL
LigandPNGBDBM50285779(CHEMBL4165205)
Affinity DataIC50:  0.160nM. Assay description: Antagonist activity at recombinant human LPA1 expressed in CHO cell membranes pretreated for 24 hrs prior to Fura-2-AM dye addition for 1 hr followed...
In DepthDetails ArticlePubMed
TargetLysophosphatidic acid receptor 1(Homo sapiens (Human))
Ono Pharmaceutical
Curated by ChEMBL
LigandPNGBDBM50285779(CHEMBL4165205)
Affinity DataIC50:  86nM. Assay description: Antagonist activity at recombinant human LPA1 expressed in CHO cells assessed as reduction in LPA-induced intracellular calcium level pretreated foll...
In DepthDetails ArticlePubMed
TargetLysophosphatidic acid receptor 1(Homo sapiens (Human))
Ono Pharmaceutical
Curated by ChEMBL
LigandPNGBDBM50285779(CHEMBL4165205)
Affinity DataKd:  1.30nM. Assay description: Binding affinity to recombinant human LPA1 expressed in CHO cell membranes measured after 1 hr by scintillation counting method
In DepthDetails ArticlePubMed