BDBM50288372 CHEMBL4173429
SMILES Cc1cnc(Nc2cc(cc(c2)S(C)(=O)=O)N2CCNCC2)nc1Nc1cccc(CO)c1
InChI Key InChIKey=ZGCSJHMBKCQCMG-UHFFFAOYSA-N
Data  3 IC50  1 EC50
  Tab Delimited (TSV)   2D SDfile   Computed 3D by Vconf -m prep SDfile
Find this compound or compounds like it in BindingDB:
Activity Spreadsheet -- Enzyme Inhibition Constant Data from BindingDB
Found 4 hits for monomerid = 50288372
TargetTyrosine-protein kinase JAK1(Homo sapiens (Human))
Astrazeneca
Curated by ChEMBL
LigandPNGBDBM50288372(CHEMBL4173429)
Affinity DataIC50: <3nM. Assay description: Inhibition of cytoplasmic recombinant human GST-tagged JAK1 (886 to 1154 residues) expressed in insect cells using FITC-C6-KKHTDDGYMPMSPGVA-NH as sub...
In DepthDetails ArticlePubMed
TargetTyrosine-protein kinase JAK1(Homo sapiens (Human))
Astrazeneca
Curated by ChEMBL
LigandPNGBDBM50288372(CHEMBL4173429)
Affinity DataEC50:  496nM. Assay description: Inhibition of JAK1 in human NCI-H1975 cells assessed as reduction in STAT3 phosphorylation after 1 hr by ELISA
In DepthDetails ArticlePubMed
TargetTyrosine-protein kinase JAK2(Homo sapiens (Human))
Astrazeneca
Curated by ChEMBL
LigandPNGBDBM50288372(CHEMBL4173429)
Affinity DataIC50:  951nM. Assay description: Inhibition of recombinant human JAK2 (831 to 1132 residues) expressed in insect cells using 5FAM-GEEPLYWSFPAKKK-NH2 as substrate after 10 mins by cal...
In DepthDetails ArticlePubMed
TargetTyrosine-protein kinase JAK3(Homo sapiens (Human))
Astrazeneca
Curated by ChEMBL
LigandPNGBDBM50288372(CHEMBL4173429)
Affinity DataIC50: >3.00E+4nM. Assay description: Inhibition of recombinant human JAK3 (781 to 1124 residues) expressed in insect cells using 5FAM-GEEPLYWSFPAKKK-NH2 as substrate after 10 mins by cal...
In DepthDetails ArticlePubMed