BDBM50292758 17beta-Hydroxy-11beta-{4-[5-(1,3-dioxol-2-yl)-N-methylpentylamino]-phenyl}-17alpha-(1-propinyl)-estra-4,9-dien-3-one::CHEMBL507253
SMILES CC#C[C@]1(O)CC[C@H]2[C@@H]3CCC4=CC(=O)CCC4=C3[C@H](C[C@]12C)c1ccc(cc1)N(C)CCCCCC1OCCO1
InChI Key InChIKey=RXBCIQKTFIEBFN-ONBGVYQJSA-N
Data  2 IC50
  Tab Delimited (TSV)   2D SDfile   Computed 3D by Vconf -m prep SDfile
Find this compound or compounds like it in BindingDB:
Activity Spreadsheet -- Enzyme Inhibition Constant Data from BindingDB
Found 2 hits for monomerid = 50292758
TargetProgesterone receptor(Homo sapiens (Human))
University Of Graz
Curated by ChEMBL
LigandPNGBDBM50292758(17beta-Hydroxy-11beta-{4-[5-(1,3-dioxol-2-yl)-N-me...)
Affinity DataIC50:  0.170nM. Assay description: Antagonist activity at progesterone receptor in human T47D cells assessed as inhibition of progesterone-induced alkaline phosphatase activity after 4...
In DepthDetails ArticlePubMed
TargetProgesterone receptor(Homo sapiens (Human))
University Of Graz
Curated by ChEMBL
LigandPNGBDBM50292758(17beta-Hydroxy-11beta-{4-[5-(1,3-dioxol-2-yl)-N-me...)
Affinity DataIC50:  0.0730nM. Assay description: Antagonist activity at progesterone receptor in human T47D-C124 cells transfected with luciferase gene linked to MMTV promoter assessed as inhibition...
In DepthDetails ArticlePubMed