BDBM50292925 (4R,7S,10S,13R,16S,19R)-13-((1H-indol-3-yl)methyl)-N-((2S,3R)-1-amino-3-hydroxy-1-oxobutan-2-yl)-10-(3-guanidinopropyl)-16-(4-hydroxybenzyl)-7-((R)-1-hydroxyethyl)-3,3-dimethyl-6,9,12,15,18-pentaoxo-19-((R)-1,2,3,4-tetrahydroisoquinoline-3-carboxamido)-1,2-dithia-5,8,11,14,17-pentaazacycloicosane-4-carboxamide::CHEMBL525046
SMILES C[C@@H](O)[C@H](NC(=O)[C@H]1NC(=O)[C@@H](NC(=O)[C@H](CCCN=C(N)N)NC(=O)[C@@H](Cc2c[nH]c3ccccc23)NC(=O)[C@H](Cc2ccc(O)cc2)NC(=O)[C@H](CSSC1(C)C)NC(=O)[C@H]1Cc2ccccc2CN1)[C@@H](C)O)C(N)=O
InChI Key InChIKey=VZDYOAZXFPOIMZ-YYBLBLTFSA-N
Data  3 KI
  Tab Delimited (TSV)   2D SDfile   Computed 3D by Vconf -m prep SDfile
Find this compound or compounds like it in BindingDB:
Activity Spreadsheet -- Enzyme Inhibition Constant Data from BindingDB
Found 3 hits for monomerid = 50292925
TargetMu-type opioid receptor(Homo sapiens (Human))
Virginia Commonwealth University
Curated by ChEMBL
LigandPNGBDBM50292925((4R,7S,10S,13R,16S,19R)-13-((1H-indol-3-yl)methyl)...)
Affinity DataKi:  2nM. Assay description: Activity at monocloned mu opioid receptor expressed in CHO cells by [35S]GTPgammaS binding assay
In DepthDetails ArticlePubMed
TargetKappa-type opioid receptor(Homo sapiens (Human))
Virginia Commonwealth University
Curated by ChEMBL
LigandPNGBDBM50292925((4R,7S,10S,13R,16S,19R)-13-((1H-indol-3-yl)methyl)...)
Affinity DataKi:  1.01E+3nM. Assay description: Displacement of [3H]norBNI from monocloned kappa opioid receptor expressed in CHO cells
In DepthDetails ArticlePubMed
TargetDelta-type opioid receptor(Homo sapiens (Human))
Virginia Commonwealth University
Curated by ChEMBL
LigandPNGBDBM50292925((4R,7S,10S,13R,16S,19R)-13-((1H-indol-3-yl)methyl)...)
Affinity DataKi:  1.44E+3nM. Assay description: Displacement of [3H]NTI from monocloned delta opioid receptor expressed in CHO cells
In DepthDetails ArticlePubMed