BDBM50294493 2-amino-4-(((2S,3S,4R,5R)-3,4-dihydroxy-5-(6-(phenethylamino)-9H-purin-9-yl)-tetrahydrofuran-2-yl)methylthio)butanoic acid::CHEMBL563024
SMILES NC(CCSC[C@H]1O[C@H]([C@H](O)[C@@H]1O)n1cnc2c(NCCc3ccccc3)ncnc12)C(O)=O
InChI Key InChIKey=VONHOFVDOPIQRY-BWZSZYTASA-N
Data  2 IC50
  Tab Delimited (TSV)   2D SDfile   Computed 3D by Vconf -m prep SDfile
Find this compound or compounds like it in BindingDB:
Activity Spreadsheet -- Enzyme Inhibition Constant Data from BindingDB
Found 2 hits for monomerid = 50294493
TargetDNA (cytosine-5)-methyltransferase 3B(Homo sapiens (Human))
Methylgene
Curated by ChEMBL
LigandPNGBDBM50294493(2-amino-4-(((2S,3S,4R,5R)-3,4-dihydroxy-5-(6-(phen...)
Affinity DataIC50:  2.00E+3nM. Assay description: Inhibition of human recombinant DNMT3b2 expressed in baculovirus infected high five insect cells
In DepthDetails ArticlePubMed
TargetDNA (cytosine-5)-methyltransferase 1(Homo sapiens (Human))
Methylgene
Curated by ChEMBL
LigandPNGBDBM50294493(2-amino-4-(((2S,3S,4R,5R)-3,4-dihydroxy-5-(6-(phen...)
Affinity DataIC50:  2.70E+4nM. Assay description: Inhibition of human recombinant DNMT1 expressed in baculovirus infected high five insect cells
In DepthDetails ArticlePubMed