BDBM50299800 4-(2-(3,4-dichlorobenzyloxy)-5-fluorophenyl)piperidine::CHEMBL573971
SMILES Fc1ccc(OCc2ccc(Cl)c(Cl)c2)c(c1)C1CCNCC1
InChI Key InChIKey=ROZQUSZIXUCKCC-UHFFFAOYSA-N
Data  4 KI
  Tab Delimited (TSV)   2D SDfile   Computed 3D by Vconf -m prep SDfile
Find this compound or compounds like it in BindingDB:
Activity Spreadsheet -- Enzyme Inhibition Constant Data from BindingDB
Found 4 hits for monomerid = 50299800
TargetSodium-dependent serotonin transporter(Homo sapiens (Human))
Pfizer
Curated by ChEMBL
LigandPNGBDBM50299800(4-(2-(3,4-dichlorobenzyloxy)-5-fluorophenyl)piperi...)
Affinity DataKi:  2nM. Assay description: Displacement of [125I]RTI-55 from human SERT expressed in HEK293 cells
In DepthDetails ArticlePubMed
TargetSodium-dependent noradrenaline transporter(Homo sapiens (Human))
Pfizer
Curated by ChEMBL
LigandPNGBDBM50299800(4-(2-(3,4-dichlorobenzyloxy)-5-fluorophenyl)piperi...)
Affinity DataKi:  20nM. Assay description: Displacement of [125I]RTI-55 from human NET expressed in HEK293 cells
In DepthDetails ArticlePubMed
TargetSodium-dependent dopamine transporter(Homo sapiens (Human))
Pfizer
Curated by ChEMBL
LigandPNGBDBM50299800(4-(2-(3,4-dichlorobenzyloxy)-5-fluorophenyl)piperi...)
Affinity DataKi:  452nM. Assay description: Displacement of [125I]RTI-55 from human DAT expressed in HEK293 cells
In DepthDetails ArticlePubMed
Target5-hydroxytryptamine receptor 1A(Homo sapiens (Human))
Pfizer
Curated by ChEMBL
LigandPNGBDBM50299800(4-(2-(3,4-dichlorobenzyloxy)-5-fluorophenyl)piperi...)
Affinity DataKi:  1.16E+3nM. Assay description: Displacement of [3H]8-OH-DPAT from human 5HT1A receptor expressed in CHO cells
In DepthDetails ArticlePubMed