BDBM50301917 CHEMBL585383::N-{3-[(5S)-5-(1,1-dimethylpropyl)-1-(4-fluoro-3-methylbenzyl)-4-hydroxy-2-oxo-2,5-dihydro-1H-pyrrol-3-yl]-1,1-dioxido-4H-1,4-benzothiazin-7-yl}methanesulfonamide::N-{3-[(S)-5-(1,1-Dimethyl-propyl)-1-(4-fluoro-3-methyl-benzyl)-4-hydroxy-2-oxo-2,5-dihydro-1H-pyrrol-3-yl]-1,1-dioxo-1,4-dihydro-1lambda*6*-benzo[1,4]thiazin-7-yl}-methanesulfonamide
SMILES CCC(C)(C)[C@@H]1N(Cc2ccc(F)c(C)c2)C(=O)C(C1=O)C1=Nc2ccc(NS(C)(=O)=O)cc2S(=O)(=O)C1
InChI Key InChIKey=LSBGCBROIWUKLB-SYIFMXBLSA-N
Data  1 IC50
  Tab Delimited (TSV)   2D SDfile   Computed 3D by Vconf -m prep SDfile
Find this compound or compounds like it in BindingDB:
Activity Spreadsheet -- Enzyme Inhibition Constant Data from BindingDB
Found 1 hit for monomerid = 50301917
TargetGenome polyprotein(Hepatitis C virus (HCV))
Roche Palo Alto
Curated by ChEMBL
LigandPNGBDBM50301917(CHEMBL585383 | N-{3-[(5S)-5-(1,1-dimethylpropyl)-1...)
Affinity DataIC50:  13nM. Assay description: Inhibition of HSV 1b con1 NS5B polymerase assessed as [3H]UTP incorporation into acid insoluble RNA product
In DepthDetails ArticlePubMed