BDBM50305068 4-(3-(3-(isopropylsulfonyl)phenoxy)phenyl)-3-methyl-8-(trifluoromethyl)quinoline::CHEMBL595113
SMILES CC(C)S(=O)(=O)c1cccc(Oc2cccc(c2)-c2c(C)cnc3c(cccc23)C(F)(F)F)c1
InChI Key InChIKey=YYDPUXBLDMRZQE-UHFFFAOYSA-N
Data  2 IC50
  Tab Delimited (TSV)   2D SDfile   Computed 3D by Vconf -m prep SDfile
Find this compound or compounds like it in BindingDB:
Activity Spreadsheet -- Enzyme Inhibition Constant Data from BindingDB
Found 2 hits for monomerid = 50305068
TargetOxysterols receptor LXR-alpha(Homo sapiens (Human))
Wyeth Pharmaceuticals
Curated by ChEMBL
LigandPNGBDBM50305068(4-(3-(3-(isopropylsulfonyl)phenoxy)phenyl)-3-methy...)
Affinity DataIC50:  1.80nM. Assay description: Displacement of [3H]T0901317 from human recombinant LXRalpha-LBD
In DepthDetails ArticlePubMed
TargetOxysterols receptor LXR-beta(Homo sapiens (Human))
Wyeth Pharmaceuticals
Curated by ChEMBL
LigandPNGBDBM50305068(4-(3-(3-(isopropylsulfonyl)phenoxy)phenyl)-3-methy...)
Affinity DataIC50:  7.90nM. Assay description: Displacement of [3H]T0901317 from human recombinant LXRbeta-LBD
In DepthDetails ArticlePubMed