BDBM50308731 1-amino-5-naphthalene sulfonate::5-aminonaphthalene-1-sulfonic acid::CHEMBL589370
SMILES Nc1cccc2c(cccc12)S(O)(=O)=O
InChI Key InChIKey=DQNAQOYOSRJXFZ-UHFFFAOYSA-N
Data  1 Kd
PDB links: 1 PDB ID matches this monomer.
  Tab Delimited (TSV)   2D SDfile   Computed 3D by Vconf -m prep SDfile
Find this compound or compounds like it in BindingDB:
Activity Spreadsheet -- Enzyme Inhibition Constant Data from BindingDB
Found 1 hit for monomerid = 50308731
TargetTransthyretin(Homo sapiens (Human))
Universidade Federal Do Rio De Janeiro
Curated by ChEMBL
LigandPNGBDBM50308731(1-amino-5-naphthalene sulfonate | 5-aminonaphthale...)
Affinity DataKd:  6.40E+4nM. Assay description: Binding affinity to wild type human TTR denominated hormone binding site expressed in Escherichia coli by FRET analysis