BDBM50314448 (S)-N-((S)-1-cyclohexyl-2-((S)-2-(4-(naphthalen-1-yl)thiazol-2-yl)pyrrolidin-1-yl)-2-oxoethyl)-2-(methylamino)propanamide::CHEMBL1091044::N-{(1S)-1-cyclohexyl-2-[(2S)-2-(4-naphthalen-1-yl-1,3-thiazol-2-yl)pyrrolidin-1-yl]-2-oxoethyl}-N~2~-methyl-L-alaninamide
SMILES CN[C@@H](C)C(=O)N[C@@H](C1CCCCC1)C(=O)N1CCC[C@H]1c1nc(cs1)-c1cccc2ccccc12
InChI Key InChIKey=OWHXKYSKEROHGU-CNVLFFCLSA-N
Data  2 KI
PDB links: 1 PDB ID matches this monomer.
  Tab Delimited (TSV)   2D SDfile   Computed 3D by Vconf -m prep SDfile
Find this compound or compounds like it in BindingDB:
Activity Spreadsheet -- Enzyme Inhibition Constant Data from BindingDB
Found 2 hits for monomerid = 50314448
TargetE3 ubiquitin-protein ligase XIAP(Homo sapiens (Human))
Genentech
Curated by ChEMBL
LigandPNGBDBM50314448((S)-N-((S)-1-cyclohexyl-2-((S)-2-(4-(naphthalen-1-...)
Affinity DataKi:  6.80E+4nM. Assay description: Antagonist activity at XIAP BIR3 domain by fluorescence polarization assay ... On Thursday, November 10, 2011 9:19 AM from cohen.fred@gene.com: Unfor...Checked by Author
In DepthDetails ArticlePubMed
TargetBaculoviral IAP repeat-containing protein 7(Homo sapiens (Human))
Genentech
Curated by ChEMBL
LigandPNGBDBM50314448((S)-N-((S)-1-cyclohexyl-2-((S)-2-(4-(naphthalen-1-...)
Affinity DataKi:  1.10E+5nM. Assay description: Antagonist activity at ML-IAP MLXBIR3SG domain by fluorescence polarization assay ... On Thursday, November 10, 2011 9:19 AM from cohen.fred@gene.com...Checked by Author