BDBM50316355 2-(5-{[(2S)-2-Amino-3-(1H-indol-3-yl)propyl]oxy}pyridin-3-yl)-8,9-dimethoxybenzo[c]-2,7-naphthyridin-4-amine::CHEMBL1095612
SMILES COc1cc2ncc3c(N)nc(cc3c2cc1OC)-c1cncc(OC[C@@H](N)Cc2c[nH]c3ccccc23)c1
InChI Key InChIKey=ZWSYVXUTWLOAGF-IBGZPJMESA-N
Data  3 IC50
  Tab Delimited (TSV)   2D SDfile   Computed 3D by Vconf -m prep SDfile
Find this compound or compounds like it in BindingDB:
Activity Spreadsheet -- Enzyme Inhibition Constant Data from BindingDB
Found 3 hits for monomerid = 50316355
Target3-phosphoinositide-dependent protein kinase 1(Homo sapiens (Human))
Wyeth Research
Curated by ChEMBL
LigandPNGBDBM50316355(2-(5-{[(2S)-2-Amino-3-(1H-indol-3-yl)propyl]oxy}py...)
Affinity DataIC50:  6nM. Assay description: Inhibition of human GST-tagged-PDK1 expressed in HEK293 cells
In DepthDetails ArticlePubMed
TargetRibosomal protein S6 kinase beta-1(Homo sapiens (Human))
Wyeth Research
Curated by ChEMBL
LigandPNGBDBM50316355(2-(5-{[(2S)-2-Amino-3-(1H-indol-3-yl)propyl]oxy}py...)
Affinity DataIC50:  77nM. Assay description: Inhibition of p70S6K
In DepthDetails ArticlePubMed
TargetRAC-alpha serine/threonine-protein kinase(Homo sapiens (Human))
Wyeth Research
Curated by ChEMBL
LigandPNGBDBM50316355(2-(5-{[(2S)-2-Amino-3-(1H-indol-3-yl)propyl]oxy}py...)
Affinity DataIC50:  302nM. Assay description: Inhibition of AKT
In DepthDetails ArticlePubMed