BDBM50319787 2'-methoxy-N-methyl-4'-((1S,5R)-1,3,3-trimethyl-6-azabicyclo[3.2.1]octane-6-carbonyl)biphenyl-3-carboxamide::CHEMBL1086294
SMILES CNC(=O)c1cccc(c1)-c1ccc(cc1OC)C(=O)N1C[C@]2(C)C[C@H]1CC(C)(C)C2
InChI Key InChIKey=IVQNYSRYAHADJO-FQRUVTKNSA-N
Data  2 KI
  Tab Delimited (TSV)   2D SDfile   Computed 3D by Vconf -m prep SDfile
Find this compound or compounds like it in BindingDB:
Activity Spreadsheet -- Enzyme Inhibition Constant Data from BindingDB
Found 2 hits for monomerid = 50319787
TargetVasopressin V1a receptor(Homo sapiens (Human))
Pfizer
Curated by ChEMBL
LigandPNGBDBM50319787(2'-methoxy-N-methyl-4'-((1S,5R)-1,3,3-trimethyl-6-...)
Affinity DataKi:  1.03nM. Assay description: Displacement [3H]Arg human recombinant Vasopressin V1a receptor
In DepthDetails ArticlePubMed
TargetVasopressin V2 receptor(Homo sapiens (Human))
Pfizer
Curated by ChEMBL
LigandPNGBDBM50319787(2'-methoxy-N-methyl-4'-((1S,5R)-1,3,3-trimethyl-6-...)
Affinity DataKi:  1.17E+3nM. Assay description: Displacement [3H]Arg human recombinant Vasopressin V2 receptor
In DepthDetails ArticlePubMed