BDBM50329090 (Z)-methyl 2-(7-chloro-2-oxo-2H-benzo[b][1,4]oxazin-3(4H)-ylidene)acetate::CHEMBL1269431
SMILES COC(=O)Cc1nc2ccc(Cl)cc2oc1=O
InChI Key InChIKey=OMLPEXYMYZOUBF-UHFFFAOYSA-N
Data  1 IC50
  Tab Delimited (TSV)   2D SDfile   Computed 3D by Vconf -m prep SDfile
Find this compound or compounds like it in BindingDB:
Activity Spreadsheet -- Enzyme Inhibition Constant Data from BindingDB
Found 1 hit for monomerid = 50329090
Target1,4-dihydroxy-2-naphthoyl-CoA synthase(Mycobacterium tuberculosis)
Stony Brook University
Curated by ChEMBL
LigandPNGBDBM50329090((Z)-methyl 2-(7-chloro-2-oxo-2H-benzo[b][1,4]oxazi...)
Affinity DataIC50:  3.57E+4nM. Assay description: Inhibition of Mycobacterium tuberculosis MenB expressed in Escherichia coli BL21 (DE3) by double-reciprocal plot analysis
In DepthDetails ArticlePubMed