BDBM50330954 CHEMBL1276973::de-O-sulfonated kotalanol
SMILES OC[C@H](O)[C@@H](O)[C@@H](O)[C@H](O)[C@H](O)C[S+]1C[C@@H](O)[C@H](O)[C@H]1CO
InChI Key InChIKey=JWOANRNVWBCYDC-PVOSGLMWSA-N
Data  1 KI
  Tab Delimited (TSV)   2D SDfile   Computed 3D by Vconf -m prep SDfile
Find this compound or compounds like it in BindingDB:
Activity Spreadsheet -- Enzyme Inhibition Constant Data from BindingDB
Found 1 hit for monomerid = 50330954
TargetMaltase-glucoamylase(Homo sapiens (Human))
Simon Fraser University
Curated by ChEMBL
LigandPNGBDBM50330954(CHEMBL1276973 | de-O-sulfonated kotalanol)
Affinity DataKi:  30nM. Assay description: Inhibition of human recombinant N-terminal subunit of maltase-glucoamylase after 60 mins by glucose oxidase assay
In DepthDetails ArticlePubMed