BDBM50331393 4-(1-(2,3-dimethoxybenzyl)-1H-1,2,3-triazol-4-yl)phenol::CHEMBL1289631
SMILES COc1cccc(Cn2cc(nn2)-c2ccc(O)cc2)c1OC
InChI Key InChIKey=IAZNDXVEAROTIW-UHFFFAOYSA-N
Data  1 IC50
  Tab Delimited (TSV)   2D SDfile   Computed 3D by Vconf -m prep SDfile
Find this compound or compounds like it in BindingDB:
Activity Spreadsheet -- Enzyme Inhibition Constant Data from BindingDB
Found 1 hit for monomerid = 50331393
TargetMacrophage migration inhibitory factor(Homo sapiens (Human))
Yale University
Curated by ChEMBL
LigandPNGBDBM50331393(4-(1-(2,3-dimethoxybenzyl)-1H-1,2,3-triazol-4-yl)p...)
Affinity DataIC50:  750nM. Assay description: Inhibition of human MIF tautomerase activity using 4-hydroxyphenylpyruvate as substrate
In DepthDetails ArticlePubMed