BDBM50333434 3-(2-fluoro-6-(2-fluoro-6-methylphenoxy)phenoxy)azetidine::CHEMBL1645601
SMILES Cc1cccc(F)c1Oc1cccc(F)c1OC1CNC1
InChI Key InChIKey=QHOAGSGZOCDBGO-UHFFFAOYSA-N
Data  4 KI  2 EC50
  Tab Delimited (TSV)   2D SDfile   Computed 3D by Vconf -m prep SDfile
Find this compound or compounds like it in BindingDB:
Activity Spreadsheet -- Enzyme Inhibition Constant Data from BindingDB
Found 6 hits for monomerid = 50333434
Target5-hydroxytryptamine receptor 1A(Homo sapiens (Human))
Pfizer
Curated by ChEMBL
LigandPNGBDBM50333434(3-(2-fluoro-6-(2-fluoro-6-methylphenoxy)phenoxy)az...)
Affinity DataKi:  3nM. Assay description: Displacement of [3H]8-OH-DPAT from human cloned 5HT1A receptor by liquid scintillation spectrophotometry
In DepthDetails ArticlePubMed
TargetSodium-dependent noradrenaline transporter(Homo sapiens (Human))
Pfizer
Curated by ChEMBL
LigandPNGBDBM50333434(3-(2-fluoro-6-(2-fluoro-6-methylphenoxy)phenoxy)az...)
Affinity DataKi:  116nM. Assay description: Displacement of [3H]nisoxetine from human NET by scintillation proximity assay
In DepthDetails ArticlePubMed
TargetSodium-dependent serotonin transporter(Homo sapiens (Human))
Pfizer
Curated by ChEMBL
LigandPNGBDBM50333434(3-(2-fluoro-6-(2-fluoro-6-methylphenoxy)phenoxy)az...)
Affinity DataKi:  1.16E+3nM. Assay description: Displacement of [3H]citalopram from human SERT by scintillation proximity assay
In DepthDetails ArticlePubMed
TargetSodium-dependent dopamine transporter(Homo sapiens (Human))
Pfizer
Curated by ChEMBL
LigandPNGBDBM50333434(3-(2-fluoro-6-(2-fluoro-6-methylphenoxy)phenoxy)az...)
Affinity DataKi: >6.46E+3nM. Assay description: Displacement of [3H]WIN-35,428 from human DAT by scintillation proximity assay
In DepthDetails ArticlePubMed
Target5-hydroxytryptamine receptor 1A(Homo sapiens (Human))
Pfizer
Curated by ChEMBL
LigandPNGBDBM50333434(3-(2-fluoro-6-(2-fluoro-6-methylphenoxy)phenoxy)az...)
Affinity DataEC50:  225nM. Assay description: Agonist activity at 5HT1A receptor by GTPgammaS binding assay
In DepthDetails ArticlePubMed
TargetSodium-dependent noradrenaline transporter(Homo sapiens (Human))
Pfizer
Curated by ChEMBL
LigandPNGBDBM50333434(3-(2-fluoro-6-(2-fluoro-6-methylphenoxy)phenoxy)az...)
Affinity DataEC50:  239nM. Assay description: Agonist activity at human cloned NET expressed in HEK293 cells by FLIPR assay
In DepthDetails ArticlePubMed