BDBM50336826 3-[(2-Aminothiazol)-4-ethynyl]benzonitrile::CHEMBL1672271
SMILES Nc1nc(cs1)C#Cc1cccc(c1)C#N
InChI Key InChIKey=JAEKGWCMCXPYLV-UHFFFAOYSA-N
Data  1 KI
  Tab Delimited (TSV)   2D SDfile   Computed 3D by Vconf -m prep SDfile
Find this compound or compounds like it in BindingDB:
Activity Spreadsheet -- Enzyme Inhibition Constant Data from BindingDB
Found 1 hit for monomerid = 50336826
TargetMetabotropic glutamate receptor 5(Rattus norvegicus (Rat))
National Institute Of Mental Health
Curated by ChEMBL
LigandPNGBDBM50336826(3-[(2-Aminothiazol)-4-ethynyl]benzonitrile | CHEMB...)
Affinity DataKi:  0.900nM. Assay description: Displacement of [3H]MPEP from mGluR5 in rat brain
In DepthDetails ArticlePubMed