BDBM50336835 3-((2-Bromothiazol)-4-ethynyl)-5-fluorobenzonitrile::CHEMBL1672280
SMILES Fc1cc(cc(c1)C#Cc1csc(Br)n1)C#N
InChI Key InChIKey=ABAUFLMLBRRLAN-UHFFFAOYSA-N
Data  1 KI
  Tab Delimited (TSV)   2D SDfile   Computed 3D by Vconf -m prep SDfile
Find this compound or compounds like it in BindingDB:
Activity Spreadsheet -- Enzyme Inhibition Constant Data from BindingDB
Found 1 hit for monomerid = 50336835
TargetMetabotropic glutamate receptor 5(Rattus norvegicus (Rat))
National Institute Of Mental Health
Curated by ChEMBL
LigandPNGBDBM50336835(3-((2-Bromothiazol)-4-ethynyl)-5-fluorobenzonitril...)
Affinity DataKi:  0.950nM. Assay description: Displacement of [3H]MPEP from mGluR5 in rat brain
In DepthDetails ArticlePubMed